{"text_format":"1","workbook":"xlsx","n_sheets":2,"sheets":["JumpStartInputTool","Master20201031"],"not_rendered":{"charts":0,"images":0,"macros":1,"external_links":0,"defined_names":16,"comments":1,"pivot_tables":0},"unopened":[],"bounds":{"document_bytes":16777216,"sheet_cells":100000,"rows_first":2000,"rows_last":500,"rows_between":2000,"halvings":0,"cell_chars":16384,"cell_head_chars":4096},"cells_cut":0,"cells_raw":0,"read":"whole","date_system":"1900"}

{"sheet":"JumpStartInputTool","index":0,"n_rows":19,"n_cols":3,"rows_kept":19,"cut":false,"hidden":false,"merged":[[18,1,18,4],[17,1,17,4],[2,3,3,3],[9,2,9,3],[11,2,11,3],[13,2,13,3]]}
[]
[null,"Department of Behavioral Health and Developmental Services"]
[null,"Division of Developmental Services"]
[null,"Jump-Start Calculator"]
[]
[null,"Select City or County","Henrico County"]
[]
[null,"Select Service","Skilled Nursing"]
[]
[null,"Waiver Enrollees (All waivers)",{"$f":"IF(C6=\"\",\"Please Select a City/County\",CONCATENATE(VLOOKUP(C6,Master20201031!D:H,5,0),\" individual(s) were enrolled on a waiver in \",C6, \" as of \", \"Nov. 1, 2020.\"))","v":"677 individual(s) were enrolled on a waiver in Henrico County as of Nov. 1, 2020."}]
[]
[null,"Building Independence Waiver",{"$f":"IF(C6=\"\",\"Please Select a City/County\",CONCATENATE(VLOOKUP(C6,Master20201031!D:E,2,0),\" individual(s) were enrolled on a BI waiver in \",C6, \" as of Nov. 1, 2020.\"))","v":"20 individual(s) were enrolled on a BI waiver in Henrico County as of Nov. 1, 2020."}]
[]
[null,"Total Providers of Selected Service in Selected City/County",{"$f":"IF(OR(C6=\"\",C8=\"\"),\"Please Select Both a City/County and a Service\",INDEX(Master20201031!Q4:AE136,MATCH(C6,Master20201031!CityCounty,0),MATCH(C8,Master20201031!JumpStartCategories,0)))","v":1}]
[]
[null,"Recommendations for JumpStart Application:"]
[null,{"$f":"IF((\"eligible\"=IFERROR(HLOOKUP(C8,#REF!,1,FALSE),\"eligible\")),\"\",\"This service is not eligible for Jump-Start Funding.\")","v":""}]
[null,"Providers are insufficient in this area. Applications will be considered."]
[null,"There are sufficient providers in this area. You may: (1) Proceed with submission knowing that an increased amount of justification will be necessary, or (2) select a different City/County and/or Service."]

{"sheet":"Master20201031","index":1,"n_rows":178,"n_cols":32,"rows_kept":178,"cut":false,"hidden":true,"merged":[]}
["|<---  Location",null,null,"--->|","|<---               Counts of Individuals",null,null,null,null,null,null,null,null,null,null,"--->|","|<---                                                Counts of Providers (defined by distinct TaxIdentifiers)",null,null,null,null,null,null,null,null,null,null,null,null,null,null,"--->|"]
[]
["DBHDS Region","SubRegion","CSB"," City/County","BI waiver","FIS waiver","CL waiver","All waivers","SIS\nL1","SIS\nL2","SIS\nL3","SIS\nL4","SIS\nL5","SIS\nL6","SIS\nL7","SIS\nDefault","Benefits Planning","Community Coaching","Community Engagement","Community Guide","Electronic Home-Based Services","Employment and Community Transportation","Independent Living Supports","In-home Supports","Peer Mentoring","Shared Living","Supported Living","Crisis Support Services","Private Duty Nursing","Skilled Nursing","Sponsored Residential","Total Distinct"]
[1,"1-A","RapA","Caroline County",0,9,40,{"$f":"SUM(E4:G4)","v":49},4,14,3,15,3,4,4,2,0,0,0,0,0,0,0,0,0,0,0,0,0,0,0,0]
[1,"1-A","RapA","Fredericksburg City",1,8,49,58,11,18,1,17,4,4,1,2,0,1,1,0,0,0,0,1,0,0,1,0,0,0,2,2]
[1,"1-A","RapA","King George County",0,7,17,24,2,9,0,11,0,1,1,0,0,0,1,0,0,0,0,0,0,0,0,0,0,0,0,1]
[1,"1-A","RapA","Spotsylvania County",3,59,208,270,19,77,17,87,10,28,19,13,0,1,5,0,0,0,0,1,0,0,0,0,1,0,0,8]
[1,"1-A","RapA","Stafford County",3,58,173,234,13,64,11,79,10,29,19,9,0,0,2,0,0,0,0,1,0,0,0,0,3,0,0,6]
[1,"1-A","RapR","Culpeper County",2,13,81,96,18,44,1,20,0,6,3,4,0,0,3,0,0,0,0,0,0,0,0,0,0,1,0,3]
[1,"1-A","RapR","Madison County",0,3,18,21,4,10,0,5,1,0,0,1,0,0,0,0,0,0,0,0,0,0,0,0,0,0,0,0]
[1,"1-A","RapR","Orange County",3,23,40,66,15,25,1,16,2,2,1,4,0,0,0,0,0,0,0,0,0,0,0,0,0,1,0,1]
[1,"1-A","RapR","Fauquier County",0,31,57,88,7,33,1,30,4,8,2,3,0,0,0,0,1,0,0,0,0,0,0,0,1,1,0,3]
[1,"1-A","RapR","Rappahannock County",0,2,8,10,1,3,0,5,0,0,0,1,0,0,0,0,1,0,0,0,0,0,0,0,0,0,0,1]
[1,"1-B","VLY","Augusta County",1,26,135,162,5,39,4,56,9,23,19,7,0,1,1,0,0,0,0,2,0,0,0,0,0,0,2,2]
[1,"1-B","VLY","Highland County",0,0,8,8,0,1,0,2,3,0,2,0,0,0,0,0,0,0,0,0,0,0,0,0,0,0,0,0]
[1,"1-B","VLY","Staunton City",2,16,49,67,6,13,4,21,1,8,2,12,0,0,2,0,0,0,0,1,0,0,0,0,0,1,2,2]
[1,"1-B","VLY","Waynesboro City",0,6,69,75,3,19,6,27,3,7,7,3,0,0,0,0,0,0,0,0,0,0,0,0,0,0,1,1]
[1,"1-B","ALLE","Alleghany County",1,11,35,47,4,17,0,14,0,6,3,3,0,0,1,0,0,0,0,2,0,0,0,0,0,0,0,2]
[1,"1-B","ALLE","Covington City",0,1,14,15,1,4,1,3,1,0,1,4,0,0,1,0,0,0,0,1,0,0,0,0,0,1,0,1]
[1,"1-B","ROC","Bath County",0,1,8,9,1,1,1,5,0,1,0,0,0,0,0,0,0,0,0,0,0,0,0,0,0,0,0,0]
[1,"1-B","ROC","Buena Vista City",0,0,7,7,0,3,1,3,0,0,0,0,0,0,0,0,0,0,0,0,0,0,0,0,0,0,0,0]
[1,"1-B","ROC","Lexington City",0,0,4,4,1,1,0,1,0,0,1,0,0,0,1,0,0,0,0,0,0,0,0,0,0,0,0,1]
[1,"1-B","ROC","Rockbridge County",0,8,52,60,3,15,4,23,2,2,9,2,0,0,1,0,0,0,0,0,0,0,0,0,0,0,0,1]
[1,"1-C","HARR","Harrisonburg City",2,15,62,79,17,24,4,25,1,5,1,2,0,0,0,1,0,0,0,0,0,0,1,0,0,0,0,2]
[1,"1-C","HARR","Rockingham County",2,36,110,148,12,48,4,51,5,16,4,8,0,3,3,0,0,0,1,3,0,0,1,0,0,2,2,5]
[1,"1-C","NW","Frederick County",3,38,111,152,8,54,9,51,2,13,8,7,0,1,2,0,0,0,0,2,0,0,0,0,0,1,1,2]
[1,"1-C","NW","Page County",0,9,20,29,2,11,2,7,2,3,2,0,0,0,0,0,0,0,0,0,0,0,0,0,0,0,0,0]
[1,"1-C","NW","Shenandoah County",2,20,87,109,3,44,4,47,1,8,1,1,0,0,2,0,0,0,0,0,0,0,0,0,0,0,0,2]
[1,"1-C","NW","Warren County",2,27,17,46,7,18,2,13,0,3,1,2,0,0,1,0,0,0,0,1,0,0,0,0,0,0,0,2]
[1,"1-C","NW","Winchester City",1,16,69,86,10,35,6,26,1,2,6,0,0,2,4,0,0,0,0,0,0,0,1,0,0,0,0,4]
[1,"1-C","NW","Clarke County",0,5,14,19,1,12,1,5,0,0,0,0,0,0,0,0,0,0,0,0,0,0,0,0,0,0,0,0]
[1,"1-D","RTEN","Nelson County",0,8,28,36,2,12,1,15,1,3,2,0,0,0,1,0,0,0,0,0,0,0,0,0,0,0,0,1]
[1,"1-D","RTEN","Louisa County",2,23,33,58,3,19,1,15,2,3,3,12,0,0,1,0,0,0,0,0,0,0,0,0,0,0,0,1]
[1,"1-D","RTEN","Albemarle County",5,41,93,139,16,47,4,50,2,9,5,6,0,2,3,0,0,0,1,3,0,0,0,0,1,1,3,5]
[1,"1-D","RTEN","Charlottesville City",2,15,69,86,12,34,0,27,0,11,0,2,0,0,0,0,0,0,0,0,0,0,0,0,0,0,0,0]
[1,"1-D","RTEN","Fluvanna County",0,7,15,22,2,8,0,3,0,5,1,3,0,0,0,0,0,0,0,0,0,0,0,0,0,0,0,0]
[1,"1-D","RTEN","Greene County",0,8,14,22,3,6,0,7,1,4,1,0,0,0,0,0,0,0,0,0,0,0,0,0,0,0,0,0]
[1,"1-D","HORI","Amherst County",0,18,163,181,4,30,5,80,10,23,26,3,0,1,1,0,0,0,0,0,0,0,0,0,0,1,3,3]
[1,"1-D","HORI","Appomattox County",0,10,28,38,2,12,1,9,4,5,4,1,0,0,0,0,0,0,0,1,0,0,0,0,0,0,1,1]
[1,"1-D","HORI","Bedford County",1,32,159,192,6,35,2,79,10,30,18,12,0,1,4,0,0,0,0,2,0,0,0,0,0,1,4,5]
[1,"1-D","HORI","Campbell County",2,33,147,182,7,36,7,68,12,33,16,3,0,0,0,0,0,0,0,0,0,0,0,0,0,0,0,0]
[1,"1-D","HORI","Lynchburg City",2,43,187,232,15,66,9,80,7,31,17,7,0,1,2,0,0,0,1,2,0,0,0,0,0,1,9,9]
[2,"2-A","ALEX","Alexandria City",3,26,74,103,12,39,5,36,1,3,1,6,0,0,1,0,0,0,0,1,0,0,1,0,2,0,0,3]
[2,"2-A","ARLI","Arlington County",5,58,109,172,10,55,7,58,5,11,11,15,0,0,0,0,0,0,0,1,0,0,0,0,0,0,0,1]
[2,"2-B","FFFC","Fairfax City",0,1,6,7,0,2,0,4,0,0,1,0,0,0,0,0,0,0,0,0,0,0,0,0,0,0,0,0]
[2,"2-B","FFFC","Fairfax County",23,420,892,1335,77,346,55,489,38,121,113,96,0,6,7,1,0,0,1,16,0,0,3,1,23,5,2,45]
[2,"2-B","FFFC","Falls Church City",0,0,2,2,0,0,1,0,0,0,1,0,0,0,0,0,0,0,0,0,0,0,0,0,2,0,0,2]
[2,"2-C","LOUD","Loudoun County",11,99,174,284,19,74,13,95,8,37,19,19,0,0,2,0,0,0,0,3,0,0,0,0,8,4,0,10]
[2,"2-D","PWC","Manassas City",0,2,15,17,1,9,0,7,0,0,0,0,0,0,1,0,0,0,0,0,0,0,0,0,0,0,0,1]
[2,"2-D","PWC","Manassas Park City",0,1,3,4,0,2,1,0,0,0,1,0,0,0,0,0,0,0,0,0,0,0,0,0,0,0,0,0]
[2,"2-D","PWC","Prince William County",12,151,390,553,9,162,30,195,18,61,31,47,1,1,2,1,0,0,0,3,0,0,0,1,11,4,2,19]
[3,"3-A","BLUE","Botetourt County",0,18,27,45,0,10,1,19,2,10,2,1,0,1,2,0,0,0,0,0,0,0,0,0,0,1,0,2]
[3,"3-A","BLUE","Craig County",1,4,3,8,1,3,0,1,1,2,0,0,0,0,0,0,0,0,0,1,0,0,0,0,0,0,0,1]
[3,"3-A","BLUE","Roanoke City",11,30,104,145,11,44,8,46,9,12,11,4,0,2,4,0,0,0,1,1,0,0,0,0,1,2,3,7]
[3,"3-A","BLUE","Roanoke County",7,49,193,249,16,65,12,98,5,20,21,12,0,1,4,0,0,0,1,4,0,0,0,0,0,1,5,6]
[3,"3-A","BLUE","Salem City",1,7,31,39,1,14,3,16,1,2,1,1,0,3,4,0,0,0,0,3,0,0,0,0,1,3,0,7]
[3,"3-A","NRV","Giles County",0,5,30,35,0,4,3,17,3,6,1,1,0,1,0,0,0,0,0,0,0,0,0,1,0,0,0,1]
[3,"3-A","NRV","Montgomery County",0,42,90,132,15,25,5,40,4,16,20,7,0,2,3,0,0,0,0,3,0,0,0,1,2,1,2,4]
[3,"3-B","PDMT","Franklin County",5,14,87,106,3,33,9,37,6,15,3,0,0,0,1,0,0,0,0,0,0,0,0,0,0,0,0,1]
[3,"3-B","DANV","Danville City",17,27,161,205,23,51,5,76,6,18,19,7,0,2,4,1,0,0,2,6,0,0,1,0,1,2,2,9]
[3,"3-B","DANV","Pittsylvania County",12,23,138,173,8,43,7,72,5,14,16,8,0,0,1,0,0,0,0,0,0,0,0,0,0,0,0,1]
[3,"3-B","PDMT","Henry County",2,18,91,111,10,32,6,40,0,10,10,3,0,0,0,0,0,0,0,0,0,0,0,0,0,0,0,0]
[3,"3-B","PDMT","Martinsville City",0,6,34,40,4,19,1,8,2,3,2,1,0,0,1,0,0,0,0,1,0,0,0,0,0,0,0,2]
[3,"3-B","SS","Halifax County",1,11,76,88,9,35,5,31,2,3,2,1,0,1,1,0,0,0,0,0,0,0,0,0,0,0,0,1]
[3,"3-B","SS","Mecklenburg County",0,9,86,95,2,35,0,44,2,5,7,0,0,1,1,0,0,0,0,0,0,0,0,0,0,1,1,2]
[3,"3-B","SS","Brunswick County",0,0,33,33,1,13,0,15,2,2,0,0,0,0,1,0,0,0,0,0,0,0,0,0,0,0,0,1]
[3,"3-B","PDMT","Patrick County",1,3,20,24,0,8,0,10,2,4,0,0,0,0,1,0,0,0,0,0,0,0,0,0,0,0,0,1]
[3,"3-C","MTRG","Carroll County",1,13,187,{"$f":"SUM(E68:G68)","v":201},0,21,6,76,35,32,27,4,0,0,0,0,0,0,0,0,0,0,0,0,0,0,1,1]
[3,"3-C","MTRG","Galax City",0,2,32,34,0,7,0,14,3,1,7,2,0,0,4,0,0,0,0,1,0,0,0,0,0,1,3,5]
[3,"3-C","MTRG","Grayson County",1,2,33,36,0,5,1,20,3,6,1,0,0,0,0,0,0,0,0,0,0,0,0,0,0,0,0,0]
[3,"3-C","MTRG","Bland County",0,2,9,11,0,2,0,8,0,1,0,0,0,0,0,0,0,0,0,0,0,0,0,0,0,0,0,0]
[3,"3-C","MTRG","Wythe County",0,7,68,75,2,11,1,33,13,9,5,1,0,1,1,0,0,0,0,0,0,0,1,0,1,1,2,3]
[3,"3-C","NRV","Floyd County",0,12,42,54,1,8,1,21,1,10,10,2,0,2,1,0,0,0,0,2,0,0,0,0,1,1,2,3]
[3,"3-C","NRV","Pulaski County",0,26,42,68,1,12,2,24,2,9,12,6,0,0,0,0,0,0,0,0,0,0,0,0,0,0,0,0]
[3,"3-C","NRV","Radford City",0,2,18,20,0,3,2,10,0,3,2,0,0,0,2,0,0,0,0,0,0,0,0,1,0,0,0,2]
[3,"3-D","CMT","Buchanan County",0,6,26,32,1,11,0,12,1,5,0,2,0,0,1,0,0,0,0,1,0,0,0,0,0,0,0,1]
[3,"3-D","CMT","Russell County",0,4,62,66,4,27,2,18,2,6,6,1,0,0,0,0,0,0,0,0,0,0,0,0,0,0,0,0]
[3,"3-D","CMT","Tazewell County",3,17,57,77,7,21,3,27,3,11,1,4,0,0,1,0,0,0,1,1,0,0,0,0,1,0,0,2]
[3,"3-D","DCBH","Dickenson County",0,5,30,35,3,9,1,16,3,2,0,1,0,0,1,0,0,0,0,0,0,0,0,0,0,0,0,1]
[3,"3-D","HIGH","Bristol City",1,3,46,50,1,14,3,18,5,8,0,1,0,0,0,0,0,0,0,1,0,0,0,0,0,0,0,1]
[3,"3-D","HIGH","Washington County",3,16,74,93,6,25,3,35,2,18,1,3,0,0,3,0,0,0,0,0,0,0,0,0,2,1,1,5]
[3,"3-D","MTRG","Smyth County",0,15,70,85,1,12,3,46,6,8,3,6,0,0,1,0,0,0,0,0,0,0,0,0,0,1,1,1]
[3,"3-D","PLD1","Lee County",1,13,26,40,5,13,1,15,0,4,0,2,0,0,0,0,0,0,0,0,0,0,0,0,0,0,0,0]
[3,"3-D","PLD1","Norton City",0,1,3,4,1,2,0,0,0,1,0,0,0,0,0,0,0,0,0,0,0,0,0,0,0,0,0,0]
[3,"3-D","PLD1","Scott County",1,2,56,59,1,20,3,28,3,4,0,0,0,0,0,0,0,0,0,0,0,0,0,0,0,0,0,0]
[3,"3-D","PLD1","Wise County",0,7,97,104,3,26,1,53,1,11,2,7,0,0,3,0,0,0,0,1,0,0,0,0,1,0,1,4]
[4,"4-A","CHST","Chesterfield County",26,130,975,1131,77,380,49,389,33,77,86,40,0,3,9,0,0,0,1,3,0,0,3,0,4,2,5,20]
[4,"4-A","D19","Colonial Heights City",1,5,21,27,4,8,2,5,1,3,0,4,0,0,2,0,0,0,0,0,0,0,0,0,0,0,2,3]
[4,"4-A","HANO","Hanover County",14,64,161,239,23,59,6,84,11,25,15,16,0,1,4,0,0,0,0,1,0,0,1,0,1,0,1,7]
[4,"4-A","HENR","Charles City County",0,5,5,10,0,6,0,2,0,0,0,2,0,0,0,0,0,0,0,0,0,0,0,0,0,0,0,0]
[4,"4-A","HENR","Henrico County",20,142,515,677,51,256,24,240,13,29,47,17,3,3,9,0,0,0,2,5,0,1,2,0,2,1,5,18]
[4,"4-A","HENR","New Kent County",0,2,20,22,0,5,1,11,1,4,0,0,0,0,0,0,0,0,0,0,0,0,1,0,0,0,1,2]
[4,"4-A","RBHA","Richmond City",9,54,243,306,20,81,10,136,9,27,11,12,0,2,2,0,0,0,0,1,0,0,0,0,3,1,1,7]
[4,"4-B","CROS","Amelia County",0,2,11,13,0,5,0,6,0,1,0,1,0,0,0,0,0,0,0,0,0,0,0,0,0,0,0,0]
[4,"4-B","CROS","Buckingham County",1,1,15,17,0,6,1,6,1,2,0,1,0,0,0,0,0,0,0,0,0,0,0,0,0,0,0,0]
[4,"4-B","CROS","Cumberland County",1,2,26,29,1,8,0,16,2,1,0,1,0,0,1,0,0,0,0,0,0,0,0,0,0,0,0,1]
[4,"4-B","GOOC","Goochland County",1,7,20,28,0,8,1,8,1,5,2,3,0,0,1,0,0,0,0,1,0,0,0,0,0,0,1,2]
[4,"4-B","GOOC","Powhatan County",1,17,24,42,1,13,0,16,1,6,1,4,0,0,2,0,0,0,0,1,0,0,0,0,0,0,1,3]
[4,"4-C","CROS","Charlotte County",0,8,23,31,3,10,2,9,0,1,4,2,0,0,2,0,0,0,0,0,0,0,0,0,0,0,0,2]
[4,"4-C","CROS","Lunenburg County",1,4,8,13,0,3,0,7,0,1,1,1,0,0,0,0,0,0,0,0,0,0,0,0,0,0,0,0]
[4,"4-C","CROS","Nottoway County",0,5,12,17,1,4,1,10,0,0,1,0,0,0,0,0,0,0,0,0,0,0,0,0,0,0,0,0]
[4,"4-C","CROS","Prince Edward County",0,7,72,79,5,35,5,30,2,0,0,2,0,0,2,0,0,0,0,2,0,0,0,0,0,0,0,3]
[4,"4-C","D19","Emporia City",0,4,2,6,0,2,0,2,0,1,0,1,0,0,0,0,0,0,0,0,0,0,0,0,1,0,0,1]
[4,"4-D","D19","Dinwiddie County",0,5,74,79,1,15,4,38,2,5,8,6,0,0,0,0,0,0,0,0,0,0,0,0,0,0,1,1]
[4,"4-D","D19","Greensville County",0,1,10,11,0,2,0,5,1,1,0,2,0,0,0,0,0,0,0,0,0,0,0,0,0,0,0,0]
[4,"4-D","D19","Hopewell City",0,7,33,40,0,9,6,15,2,0,6,2,0,0,1,0,0,0,0,0,0,0,0,0,0,0,1,2]
[4,"4-D","D19","Petersburg City",2,12,127,141,7,37,2,54,12,10,12,7,0,1,3,0,0,0,0,0,0,0,0,0,0,0,3,7]
[4,"4-D","D19","Prince George County",0,6,65,71,3,19,5,29,3,3,9,0,0,0,3,0,0,0,0,1,0,0,0,1,1,1,3,8]
[4,"4-D","D19","Surry County",0,0,3,3,0,0,0,2,0,1,0,0,0,0,0,0,0,0,0,0,0,0,0,0,0,0,0,0]
[4,"4-D","D19","Sussex County",0,1,36,37,1,8,2,22,2,2,0,0,0,0,0,0,0,0,0,0,0,0,0,0,0,0,0,0]
[5,"5-A","MPNN","Essex County",0,4,17,21,3,8,0,8,0,1,0,1,0,0,0,0,0,0,0,0,0,0,0,0,0,0,0,0]
[5,"5-A","MPNN","Gloucester County",0,15,78,93,8,24,1,30,9,18,2,1,0,0,0,0,0,0,0,1,0,0,0,0,2,1,0,3]
[5,"5-A","MPNN","King and Queen County",1,0,7,8,0,2,1,2,1,2,0,0,0,0,0,0,0,0,0,0,0,0,0,0,0,0,0,0]
[5,"5-A","MPNN","King William County",0,5,25,30,0,7,0,8,3,10,2,0,0,0,0,0,0,0,0,0,0,0,0,0,0,0,0,0]
[5,"5-A","MPNN","Lancaster County",0,0,7,7,3,3,0,1,0,0,0,0,0,0,0,0,0,0,0,0,0,0,0,0,0,0,0,0]
[5,"5-A","MPNN","Mathews County",0,2,38,40,2,15,3,17,1,1,0,1,0,0,0,0,0,0,0,0,0,0,0,0,0,0,0,0]
[5,"5-A","MPNN","Middlesex County",0,4,23,27,2,9,0,14,1,1,0,0,0,0,0,0,0,0,0,0,0,0,0,0,0,0,0,0]
[5,"5-A","MPNN","Northumberland County",0,0,9,9,1,4,0,3,0,1,0,0,0,0,0,0,0,0,0,0,0,0,0,0,0,0,0,0]
[5,"5-A","MPNN","Richmond County",0,17,48,65,10,20,5,15,1,9,4,1,0,0,0,0,0,0,0,0,0,0,0,0,0,0,0,0]
[5,"5-A","MPNN","Westmoreland County",0,4,12,16,1,9,0,4,1,1,0,0,0,0,0,0,0,0,0,0,0,0,0,0,0,0,0,0]
[5,"5-B","EAST","Accomack County",0,7,62,69,5,24,1,30,0,6,0,3,0,0,1,0,0,0,0,1,0,0,1,0,0,0,0,1]
[5,"5-B","EAST","Northampton County",0,5,46,51,6,23,0,14,2,1,3,2,0,0,0,0,0,0,0,0,0,0,0,0,0,0,0,0]
[5,"5-C","COLO","James City County",1,31,35,67,2,12,4,29,6,3,4,7,0,0,0,0,0,0,1,1,0,0,0,0,0,0,1,2]
[5,"5-C","COLO","Poquoson City",0,3,2,5,0,1,0,2,0,0,2,0,0,0,0,0,0,0,0,0,0,0,0,0,0,0,0,0]
[5,"5-C","COLO","Williamsburg City",0,4,17,21,0,9,0,5,0,2,2,3,0,0,2,0,0,0,0,2,0,0,0,0,0,0,1,2]
[5,"5-C","COLO","York County",0,20,41,61,1,14,3,25,2,7,7,2,0,0,0,0,0,0,0,0,0,0,0,0,1,0,0,1]
[5,"5-C","HAMP","Hampton City",10,54,246,310,7,69,9,141,25,30,24,5,0,2,7,0,0,0,0,3,0,0,0,0,0,1,5,11]
[5,"5-C","HAMP","Newport News City",12,44,220,276,7,59,7,139,15,26,19,4,0,2,4,0,0,0,1,7,0,0,0,0,5,2,7,20]
[5,"5-D","CHSP","Chesapeake City",7,109,294,410,19,106,7,188,15,37,23,15,0,4,7,0,0,0,1,6,0,0,0,0,5,3,7,20]
[5,"5-D","NORF","Norfolk City",26,105,300,431,19,134,14,195,24,26,13,6,0,1,4,0,0,0,1,4,0,0,0,0,1,0,2,9]
[5,"5-D","PORT","Portsmouth City",2,12,265,279,9,79,16,138,10,14,12,1,0,1,9,0,0,0,2,4,0,0,1,0,0,1,3,16]
[5,"5-D","VAB","Virginia Beach City",25,179,653,{"$f":"SUM(E132:G132)","v":857},52,256,17,392,28,66,29,17,1,3,5,0,0,0,5,18,0,1,1,0,6,5,6,27]
[5,"5-D","WT","Franklin City",0,3,26,29,0,4,0,20,3,1,0,1,0,0,2,0,0,0,0,1,0,0,0,0,1,1,1,3]
[5,"5-D","WT","Isle of Wight County",1,8,18,27,1,11,1,8,1,1,0,4,0,1,2,0,0,0,0,0,0,0,0,0,0,0,0,2]
[5,"5-D","WT","Southampton County",0,1,19,20,0,2,0,11,4,1,0,2,0,0,0,0,0,0,0,0,0,0,0,0,0,0,1,1]
[5,"5-D","WT","Suffolk City",2,29,158,189,7,41,5,85,14,19,17,1,0,4,3,0,0,0,0,3,0,0,0,0,1,1,2,8]
[]
["Regional Totals - non-Distinct"]
[1,null,null,null,"na","na","na","na","na","na","na","na","na","na","na","na",0,14,43,1,2,0,3,23,0,0,4,0,6,12,30,{"$f":"SUMIF($A$4:$A$136,$A139,AF$4:AF$136)","v":77}]
[2,null,null,null,"na","na","na","na","na","na","na","na","na","na","na","na",1,7,13,2,0,0,1,24,0,0,4,2,46,13,4,{"$f":"SUMIF($A$4:$A$136,$A140,AF$4:AF$136)","v":81}]
[3,null,null,null,"na","na","na","na","na","na","na","na","na","na","na","na",0,17,46,1,0,0,5,26,0,0,2,3,11,16,24,75]
[4,null,null,null,"na","na","na","na","na","na","na","na","na","na","na","na",3,10,41,0,0,0,3,15,0,1,7,1,12,5,25,87]
[5,null,null,null,"na","na","na","na","na","na","na","na","na","na","na","na",1,18,46,0,0,0,11,51,0,1,3,0,22,15,36,126]
["Regional Totals - Distinct"]
[1,null,null,null,{"$f":"SUMIF($A$4:$A$136,$A145,E$4:E$136)","v":42},686,2498,{"$f":"SUM(E145:G145)","v":3226},250,961,118,1098,114,336,210,139,0,10,30,1,2,0,3,17,0,0,4,0,5,6,18,51]
[2,null,null,null,54,758,1665,{"$f":"SUM(E146:G146)","v":2477},128,689,112,884,70,233,178,183,1,7,13,2,0,0,1,22,0,0,4,2,43,13,4,77]
[3,null,null,null,69,421,2182,2672,141,683,98,1044,135,291,192,88,0,12,29,1,0,0,5,20,0,0,2,1,5,7,12,41]
[4,null,null,null,77,491,2501,3069,198,979,121,1142,97,205,203,124,3,9,35,0,0,0,3,14,0,1,6,1,12,5,15,70]
[5,null,null,null,{"$f":"SUMIF($A$4:$A$136,$A149,E$4:E$136)","v":87},665,2666,3418,165,945,94,1524,166,284,163,77,1,17,36,0,0,0,11,50,0,1,3,0,20,14,34,112]
["Total Distinct",null,null,null,{"$f":"SUM(E145:E149)","v":329},{"$f":"SUM(F145:F149)","v":3021},11512,14862,{"$f":"SUM(I145:I149)","v":882},4257,543,5692,582,1349,946,611,5,53,137,4,2,0,23,117,0,2,18,4,78,43,74,330]
["SubRegional Totals - Distinct"]
[1,"1-A",null,null,{"$f":"SUMIF($B$4:$B$136,$B152,E$4:E$136)","v":12},{"$f":"SUMIF($B$4:$B$136,$B152,F$4:F$136)","v":213},691,916,{"$f":"SUMIF($B$4:$B$136,$B152,I$4:I$136)","v":94},{"$f":"SUMIF($B$4:$B$136,$B152,J$4:J$136)","v":297},35,285,34,82,50,39,0,2,9,0,2,0,0,2,0,0,1,0,4,1,2,17]
[1,"1-B",null,null,{"$f":"SUMIF($B$4:$B$136,$B153,E$4:E$136)","v":4},69,381,454,{"$f":"SUMIF($B$4:$B$136,$B153,I$4:I$136)","v":24},113,21,155,19,47,44,31,0,1,4,0,0,0,0,5,0,0,0,0,0,2,4,7]
[1,"1-C",null,null,12,166,490,668,60,246,32,225,12,50,23,20,0,6,12,1,0,0,1,6,0,0,3,0,0,3,3,17]
[1,"1-D",null,null,14,238,936,1188,72,305,30,433,49,157,93,49,0,4,8,0,0,0,2,6,0,0,0,0,1,1,13,16]
[2,"2-A",null,null,8,84,183,275,22,94,12,94,6,14,12,21,0,0,1,0,0,0,0,2,0,0,1,0,2,0,0,4]
[2,"2-B",null,null,23,421,900,1344,77,348,56,493,38,121,115,96,0,6,7,1,0,0,1,16,0,0,3,1,25,5,2,47]
[2,"2-C",null,null,11,99,174,284,19,74,13,95,8,37,19,19,0,0,2,0,0,0,0,3,0,0,0,0,8,4,0,10]
[2,"2-D",null,null,12,154,408,574,10,173,31,202,18,61,32,47,1,1,3,1,0,0,0,3,0,0,0,1,11,4,2,20]
[3,"3-A",null,null,20,155,478,653,44,165,32,237,25,68,56,26,0,7,13,0,0,0,2,10,0,0,0,1,3,4,7,17]
[3,"3-B",null,null,38,111,726,875,60,269,33,333,27,74,59,20,0,3,9,1,0,0,2,7,0,0,1,0,1,2,2,15]
[3,"3-C",null,null,2,66,431,499,4,69,13,206,57,71,64,15,0,3,6,0,0,0,0,3,0,0,1,1,2,3,5,9]
[3,"3-D",null,null,9,89,547,645,33,180,20,268,26,78,13,27,0,0,9,0,0,0,1,3,0,0,0,0,4,2,3,13]
[4,"4-A",null,null,70,402,1940,2412,175,795,92,867,68,165,159,91,3,9,26,0,0,0,3,10,0,1,6,0,10,4,12,53]
[4,"4-B",null,null,4,29,96,129,2,40,2,52,5,15,3,10,0,0,3,0,0,0,0,1,0,0,0,0,0,0,2,5]
[4,"4-C",null,null,1,28,117,146,9,54,8,58,2,3,6,6,0,0,4,0,0,0,0,2,0,0,0,0,1,0,0,6]
[4,"4-D",null,null,2,32,348,382,12,90,19,165,22,22,35,17,0,1,5,0,0,0,0,1,0,0,0,1,1,1,6,14]
[5,"5-A",null,null,1,51,264,316,30,101,10,102,17,44,8,4,0,0,0,0,0,0,0,1,0,0,0,0,2,1,0,3]
[5,"5-B",null,null,0,12,108,120,11,47,1,44,2,7,3,5,0,0,1,0,0,0,0,1,0,0,1,0,0,0,0,1]
[5,"5-C",null,null,23,156,561,740,17,164,23,341,48,68,58,21,0,4,12,0,0,0,2,13,0,0,0,0,5,3,13,33]
[5,"5-D",null,null,63,446,1733,2242,107,633,60,1037,99,165,94,47,1,13,25,0,0,0,9,35,0,1,2,0,14,10,21,78]
[null,null,null,null,null,null,null,null,null,null,null,null,null,null,null,null,"|<---                                                Counts as Noted at left (Individuals, Service Auth Lines, etc.)",null,null,null,null,null,null,null,null,null,null,null,null,null,null,"--->|"]
["(Distinct) Number of Individuals with approved Jump-Start Service Authorization Lines these 6 months"]
["Number of Individuals",null,null,null,179,1110,5932,{"$f":"SUM(E174:G174)","v":7221},521,2134,287,2632,260,748,532,107,155,356,2865,54,39,0,126,2006,0,3,155,121,340,306,2101,{"$f":"H174","v":7221}]
["Percent of possible Individuals",null,null,null,{"$f":"E174/E150","v":0.54407294832826747},{"$f":"F174/F150","v":0.36742800397219466},0.51528839471855459,0.4858700040371417,0.59070294784580502,0.50129198966408273,0.52854511970534068,0.46240337315530572,0.44673539518900346,0.5544848035581913,0.56236786469344613,0.17512274959083471]
["(Distinct) Number of (approved Jump-Start) Service Authorization Lines (SALs) these 6 months"]
["Number of Jump-Start Service Authorization Lines",null,null,null,302,2013,11455,{"$f":"SUM(E177:G177)","v":13770},928,3913,540,5017,513,1646,1055,158,198,487,4143,70,39,0,184,3469,0,3,243,207,767,607,3353,{"$f":"H177","v":13770}]
["Number of SA Lines per Person",null,null,null,{"$f":"E177/E174","v":1.6871508379888269},{"$f":"F177/F174","v":1.8135135135135134},1.9310519217801754,1.906938097216452,1.7811900191938579,1.8336457357075915,1.8815331010452963,1.9061550151975684,1.9730769230769232,2.2005347593582889,1.9830827067669172,1.4766355140186915,{"$f":"IFERROR(Q177/Q174,\"\")","v":1.2774193548387096},{"$f":"IFERROR(R177/R174,\"\")","v":1.3679775280898876},1.4460732984293194,1.2962962962962963,1,"",1.4603174603174602,1.7293120638085744,"",1,1.5677419354838709,1.7107438016528926,2.2558823529411764,1.9836601307189543,1.5959067110899572,1.906938097216452]